BDBM281862 2-({[5-(4-aminoquinazolin-6- yl)thiophen-2-yl]methyl}amino)- N-(3-fluoro-4-methylphenyl) pyridine-3-carboxamide (TFA salt)::US10030016, Example 3.50
SMILES Cc1ccc(NC(=O)c2cccnc2NCc2ccc(s2)-c2ccc3ncnc(N)c3c2)cc1F
InChI Key InChIKey=XYJUODGCUYQKPA-UHFFFAOYSA-N
Data  1 IC50
  Tab Delimited (TSV)   2D SDfile   Computed 3D by Vconf -m prep SDfile
Find this compound or compounds like it in BindingDB:
Activity Spreadsheet -- Enzyme Inhibition Constant Data from BindingDB
Found 1 hit for monomerid = 281862
Target3-phosphoinositide-dependent protein kinase 1 [51-359](Homo sapiens (Human))
Sunesis Pharmaceuticals
US Patent
LigandPNGBDBM281862(2-({[5-(4-aminoquinazolin-6- yl)thiophen-2-yl]meth...)
Affinity DataIC50: >5.00E+3nM. Assay description: PDK1 (amino acids 51-359) and AKT2 (amino acids 140-467 fused to PIFtide, amino acids EEQEMFRDFDYIADW) were expressed as N-terminally tagged GST fusi...
Ligand InfoPC cidPC sid
In DepthDetails US Patent