BDBM28195 5-(5,6-dimethoxy-1H-1,3-benzodiazol-1-yl)-3-(furan-2-ylmethoxy)thiophene-2-carboxamide::benzimidazole thiophene analogue, 47
SMILES COc1cc2ncn(-c3cc(OCc4ccco4)c(s3)C(N)=O)c2cc1OC
InChI Key InChIKey=SXMLPHKEKWTISC-UHFFFAOYSA-N
Data  1 IC50
  Tab Delimited (TSV)   2D SDfile   Computed 3D by Vconf -m prep SDfile
Find this compound or compounds like it in BindingDB:
Activity Spreadsheet -- Enzyme Inhibition Constant Data from BindingDB
Found 1 hit for monomerid = 28195
TargetSerine/threonine-protein kinase PLK1(Homo sapiens (Human))
Gsk
LigandPNGBDBM28195(5-(5,6-dimethoxy-1H-1,3-benzodiazol-1-yl)-3-(furan...)
Affinity DataIC50:  27nM. Assay description: The compound inhibitory activity was determined by incubation with purified PLK enzyme and biotinylated peptide substrate in the presence ATP/[gamma-...
In DepthDetails ArticlePubMed