BDBM281964 2-({[2-(4-aminoquinazolin- 6-yl)-1,3-thiazol-5-yl] methyl}amino)-N- (3,4-difluoro-benzyl) pyridine-3-carboxamide::US10030016, Example 6.6
SMILES Nc1ncnc2ccc(cc12)-c1ncc(CNc2ncccc2C(=O)NCc2ccc(F)c(F)c2)s1
InChI Key InChIKey=XODUQSUPSHNJQO-UHFFFAOYSA-N
Data  1 IC50
  Tab Delimited (TSV)   2D SDfile   Computed 3D by Vconf -m prep SDfile
Find this compound or compounds like it in BindingDB:
Activity Spreadsheet -- Enzyme Inhibition Constant Data from BindingDB
Found 1 hit for monomerid = 281964
Target3-phosphoinositide-dependent protein kinase 1 [51-359](Homo sapiens (Human))
Sunesis Pharmaceuticals
US Patent
LigandPNGBDBM281964(2-({[2-(4-aminoquinazolin- 6-yl)-1,3-thiazol-5-yl]...)
Affinity DataIC50: <100nM. Assay description: PDK1 (amino acids 51-359) and AKT2 (amino acids 140-467 fused to PIFtide, amino acids EEQEMFRDFDYIADW) were expressed as N-terminally tagged GST fusi...
Ligand InfoPC cidPC sid
In DepthDetails US Patent