BDBM282080 3-({[5-(4-aminoquinazolin- 6-yl)thiophen-2-yl]methyl} amino)-6-bromo-N-(3,4- difluorobenzyl)pyrazine- 2-carboxamide::US10030016, Example 10.2
SMILES Nc1ncnc2ccc(cc12)-c1ccc(CNc2ncc(Br)nc2C(=O)NCc2ccc(F)c(F)c2)s1
InChI Key InChIKey=WILIJDNKHPDBER-UHFFFAOYSA-N
Data  1 IC50
  Tab Delimited (TSV)   2D SDfile   Computed 3D by Vconf -m prep SDfile
Find this compound or compounds like it in BindingDB:
Activity Spreadsheet -- Enzyme Inhibition Constant Data from BindingDB
Found 1 hit for monomerid = 282080
Target3-phosphoinositide-dependent protein kinase 1 [51-359](Homo sapiens (Human))
Sunesis Pharmaceuticals
US Patent
LigandPNGBDBM282080(3-({[5-(4-aminoquinazolin- 6-yl)thiophen-2-yl]meth...)
Affinity DataIC50: <100nM. Assay description: PDK1 (amino acids 51-359) and AKT2 (amino acids 140-467 fused to PIFtide, amino acids EEQEMFRDFDYIADW) were expressed as N-terminally tagged GST fusi...
Ligand InfoPC cidPC sid
In DepthDetails US Patent