BDBM28380 N-[4-({4-oxo-2H,4H,5H-pyrazolo[3,4-d]pyrimidin-2-yl}methyl)phenyl]benzamide::pyrazolo[3,4-d]pyrimidin-4-one, 13a
SMILES O=C(Nc1ccc(Cn2cc3c(n2)nc[nH]c3=O)cc1)c1ccccc1
InChI Key InChIKey=ANKGYQZWGZANOK-UHFFFAOYSA-N
Data  1 KI
  Tab Delimited (TSV)   2D SDfile   Computed 3D by Vconf -m prep SDfile
Find this compound or compounds like it in BindingDB:
Activity Spreadsheet -- Enzyme Inhibition Constant Data from BindingDB
Found 1 hit for monomerid = 28380
TargetAdenosine deaminase(Bos taurus (bovine))
Universita Di Pisa
LigandPNGBDBM28380(N-[4-({4-oxo-2H,4H,5H-pyrazolo[3,4-d]pyrimidin-2-y...)
Affinity DataKi:  1.27E+4nM ΔG°:  -6.79kcal/molepH: 7.2 T: 2°C. Assay description: The activity of ADA was determined spectrophotometrically by monitoring the change in absorbance at 262 nm, due to the deamination of adenosine catal...
In DepthDetails ArticlePubMed