BDBM28400 (2E)-3-{3-[6-(4-methyl-1,4-diazepan-1-yl)pyrazin-2-yl]phenyl}prop-2-enamide::pyrazine inhibitor, 3
SMILES CN1CCCN(CC1)c1cncc(n1)-c1cccc(\C=C\C(N)=O)c1
InChI Key InChIKey=QQYNGYCPUGWHFT-VOTSOKGWSA-N
Data  1 IC50
  Tab Delimited (TSV)   2D SDfile   Computed 3D by Vconf -m prep SDfile
Find this compound or compounds like it in BindingDB:
Activity Spreadsheet -- Enzyme Inhibition Constant Data from BindingDB
Found 1 hit for monomerid = 28400
TargetSerine/threonine-protein kinase pim-2(Homo sapiens (Human))
Boehringer Ingelheim Pharmaceuticals
LigandPNGBDBM28400((2E)-3-{3-[6-(4-methyl-1,4-diazepan-1-yl)pyrazin-2...)
Affinity DataIC50:  1.20E+3nMpH: 7.5 T: 2°C. Assay description: The activity of Pim kinase was measured in a homogeneous luciferase assay using GST-Pim, biotinylated peptide substrate and a luciferin-luciferase de...
In DepthDetails ArticlePubMed