BDBM284029 4-(6-(4-(2-(2,6- difluorophenyl)acetyl)piperazin- 1-yl)pyridin-3-yl)-6- (1-methyl-1H-pyrazol-4- yl)pyrazolo[1,5-a]pyridine- 3-carbonitrile 2,2,2- trifluoroacetate::US10023570, Example 39::US10174027, Example 39
SMILES Cn1cc(cn1)-c1cc(-c2ccc(nc2)N2CCN(CC2)C(=O)Cc2c(F)cccc2F)c2c(cnn2c1)C#N
InChI Key InChIKey=PHFQSUXAJOAPRO-UHFFFAOYSA-N
Data  3 IC50
  Tab Delimited (TSV)   2D SDfile   Computed 3D by Vconf -m prep SDfile
Find this compound or compounds like it in BindingDB:
Activity Spreadsheet -- Enzyme Inhibition Constant Data from BindingDB
Found 3 hits for monomerid = 284029
TargetProto-oncogene tyrosine-protein kinase receptor Ret [658-1114](Homo sapiens (Human))
Array Biopharma
US Patent
LigandPNGBDBM284029(4-(6-(4-(2-(2,6- difluorophenyl)acetyl)piperazin- ...)
Affinity DataIC50:  6.30nMpH: 7.4Assay Description:Compounds of General Formula I were screened for their ability to inhibit wild type and V804M mutant RET kinase using CisBio's HTRF® KinEASE -TK ...
Ligand InfoPC cidPC sid
In DepthDetails US Patent
TargetProto-oncogene tyrosine-protein kinase receptor Ret(Homo sapiens (Human))
Array Biopharma
US Patent
LigandPNGBDBM284029(4-(6-(4-(2-(2,6- difluorophenyl)acetyl)piperazin- ...)
Affinity DataIC50:  6.30nM. Assay description: Compounds of General Formula I were screened for their ability to inhibit wild type and V804M mutant RET kinase using CisBio's HTRF® KinEASE¿-TK ...
Ligand InfoPC cidPC sid
In DepthDetails US Patent
TargetProto-oncogene tyrosine-protein kinase receptor Ret(Homo sapiens (Human))
Array Biopharma
US Patent
LigandPNGBDBM284029(4-(6-(4-(2-(2,6- difluorophenyl)acetyl)piperazin- ...)
Affinity DataIC50:  6.30nM. Assay description: Compounds of General Formula I were screened for their ability to inhibit wild type and V804M mutant RET kinase using CisBio's HTRF® KinEASE-TK a...
Ligand InfoPC cidPC sid
In DepthDetails US Patent