BDBM284174 US10023570, Example 184::US10174028, Example 184
SMILES Cn1cc(cn1)-c1cc(-c2ccc(nc2)N2CCC(CC2)NC(=O)c2ccccc2)c2c(cnn2c1)C#N
InChI Key InChIKey=YTKRFTCYFFEFRO-UHFFFAOYSA-N
Data  3 IC50
  Tab Delimited (TSV)   2D SDfile   Computed 3D by Vconf -m prep SDfile
Find this compound or compounds like it in BindingDB:
Activity Spreadsheet -- Enzyme Inhibition Constant Data from BindingDB
Found 3 hits for monomerid = 284174
TargetProto-oncogene tyrosine-protein kinase receptor Ret [658-1114](Homo sapiens (Human))
Array Biopharma
US Patent
LigandPNGBDBM284174(US10023570, Example 184 | US10174028, Example 184)
Affinity DataIC50:  4nMpH: 7.4Assay Description:Compounds of General Formula I were screened for their ability to inhibit wild type and V804M mutant RET kinase using CisBio's HTRF® KinEASE -TK ...
Ligand InfoPC cidPC sid
In DepthDetails US Patent
TargetProto-oncogene tyrosine-protein kinase receptor Ret(Homo sapiens (Human))
Array Biopharma
US Patent
LigandPNGBDBM284174(US10023570, Example 184 | US10174028, Example 184)
Affinity DataIC50:  4nM. Assay description: Compounds of General Formula I were screened for their ability to inhibit wild type and V804M mutant RET kinase using CisBio's HTRF® KinEASE¿-TK ...
Ligand InfoPC cidPC sid
In DepthDetails US Patent
TargetProto-oncogene tyrosine-protein kinase receptor Ret(Homo sapiens (Human))
Array Biopharma
US Patent
LigandPNGBDBM284174(US10023570, Example 184 | US10174028, Example 184)
Affinity DataIC50:  4nM. Assay description: Compounds of General Formula I were screened for their ability to inhibit wild type and V804M mutant RET kinase using CisBio's HTRF® KinEASE-TK a...
Ligand InfoPC cidPC sid
In DepthDetails US Patent