BDBM284336 6-(1-methyl-1H- pyrazol-4-yl)-4- (6-(4-(1- (trifluoromethyl) cyclopropanecarbonyl) piperazin-1- yl)pyridin-3- yl)pyrazolo[1,5- a]pyridine-3- carbonitrile::US10023570, Example 346::US10174027, Example 346
SMILES Cn1cc(cn1)-c1cc(-c2ccc(nc2)N2CCN(CC2)C(=O)C2(CC2)C(F)(F)F)c2c(cnn2c1)C#N
InChI Key InChIKey=QCYVAJNBKIYNNH-UHFFFAOYSA-N
Data  6 IC50
  Tab Delimited (TSV)   2D SDfile   Computed 3D by Vconf -m prep SDfile
Find this compound or compounds like it in BindingDB:
Activity Spreadsheet -- Enzyme Inhibition Constant Data from BindingDB
Found 6 hits for monomerid = 284336
TargetProto-oncogene tyrosine-protein kinase receptor Ret [658-1114](Homo sapiens (Human))
Array Biopharma
US Patent
LigandPNGBDBM284336(6-(1-methyl-1H- pyrazol-4-yl)-4- (6-(4-(1- (triflu...)
Affinity DataIC50:  10.1nMpH: 7.4Assay Description:Compounds of General Formula I were screened for their ability to inhibit wild type and V804M mutant RET kinase using CisBio's HTRF® KinEASE -TK ...
Ligand InfoPC cidPC sid
In DepthDetails US Patent
TargetProto-oncogene tyrosine-protein kinase receptor Ret [658-1114,V804M](Homo sapiens (Human))
Array Biopharma
US Patent
LigandPNGBDBM284336(6-(1-methyl-1H- pyrazol-4-yl)-4- (6-(4-(1- (triflu...)
Affinity DataIC50:  73.8nMpH: 7.4Assay Description:Compounds of General Formula I were screened for their ability to inhibit wild type and V804M mutant RET kinase using CisBio's HTRF® KinEASE -TK ...
Ligand InfoPC cidPC sid
In DepthDetails US Patent
TargetProto-oncogene tyrosine-protein kinase receptor Ret [V804M](Homo sapiens (Human))
Array Biopharma
US Patent
LigandPNGBDBM284336(6-(1-methyl-1H- pyrazol-4-yl)-4- (6-(4-(1- (triflu...)
Affinity DataIC50:  73.8nM. Assay description: Compounds of General Formula I were screened for their ability to inhibit wild type and V804M mutant RET kinase using CisBio's HTRF® KinEASE¿-TK ...
Ligand InfoPC cidPC sid
In DepthDetails US Patent
TargetProto-oncogene tyrosine-protein kinase receptor Ret [V804M](Homo sapiens (Human))
Array Biopharma
US Patent
LigandPNGBDBM284336(6-(1-methyl-1H- pyrazol-4-yl)-4- (6-(4-(1- (triflu...)
Affinity DataIC50:  73.8nM. Assay description: Compounds of General Formula I were screened for their ability to inhibit wild type and V804M mutant RET kinase using CisBio's HTRF® KinEASE-TK a...
Ligand InfoPC cidPC sid
In DepthDetails US Patent
TargetProto-oncogene tyrosine-protein kinase receptor Ret(Homo sapiens (Human))
Array Biopharma
US Patent
LigandPNGBDBM284336(6-(1-methyl-1H- pyrazol-4-yl)-4- (6-(4-(1- (triflu...)
Affinity DataIC50:  10.1nM. Assay description: Compounds of General Formula I were screened for their ability to inhibit wild type and V804M mutant RET kinase using CisBio's HTRF® KinEASE¿-TK ...
Ligand InfoPC cidPC sid
In DepthDetails US Patent
TargetProto-oncogene tyrosine-protein kinase receptor Ret(Homo sapiens (Human))
Array Biopharma
US Patent
LigandPNGBDBM284336(6-(1-methyl-1H- pyrazol-4-yl)-4- (6-(4-(1- (triflu...)
Affinity DataIC50:  10.1nM. Assay description: Compounds of General Formula I were screened for their ability to inhibit wild type and V804M mutant RET kinase using CisBio's HTRF® KinEASE-TK a...
Ligand InfoPC cidPC sid
In DepthDetails US Patent