BDBM284352 6-(1-methyl-1H-pyrazol- 4-yl)-4-(6-(4-(2- morpholinoacetyl)piperazin- 1-yl)pyridin-3- yl)pyrazolo[1,5- a]pyridine-3-carbonitrile bis(2,2,2-trifluoroacetate)::US10023570, Example 362::US10174027, Example 362
SMILES Cn1cc(cn1)-c1cc(-c2ccc(nc2)N2CCN(CC2)C(=O)CN2CCOCC2)c2c(cnn2c1)C#N
InChI Key InChIKey=CPCWOSXGSVWPIN-UHFFFAOYSA-N
Data  6 IC50
  Tab Delimited (TSV)   2D SDfile   Computed 3D by Vconf -m prep SDfile
Find this compound or compounds like it in BindingDB:
Activity Spreadsheet -- Enzyme Inhibition Constant Data from BindingDB
Found 6 hits for monomerid = 284352
TargetProto-oncogene tyrosine-protein kinase receptor Ret [658-1114](Homo sapiens (Human))
Array Biopharma
US Patent
LigandPNGBDBM284352(6-(1-methyl-1H-pyrazol- 4-yl)-4-(6-(4-(2- morpholi...)
Affinity DataIC50:  19.9nMpH: 7.4Assay Description:Compounds of General Formula I were screened for their ability to inhibit wild type and V804M mutant RET kinase using CisBio's HTRF® KinEASE -TK ...
Ligand InfoPC cidPC sid
In DepthDetails US Patent
TargetProto-oncogene tyrosine-protein kinase receptor Ret [658-1114,V804M](Homo sapiens (Human))
Array Biopharma
US Patent
LigandPNGBDBM284352(6-(1-methyl-1H-pyrazol- 4-yl)-4-(6-(4-(2- morpholi...)
Affinity DataIC50:  169nMpH: 7.4Assay Description:Compounds of General Formula I were screened for their ability to inhibit wild type and V804M mutant RET kinase using CisBio's HTRF® KinEASE -TK ...
Ligand InfoPC cidPC sid
In DepthDetails US Patent
TargetProto-oncogene tyrosine-protein kinase receptor Ret [V804M](Homo sapiens (Human))
Array Biopharma
US Patent
LigandPNGBDBM284352(6-(1-methyl-1H-pyrazol- 4-yl)-4-(6-(4-(2- morpholi...)
Affinity DataIC50:  169nM. Assay description: Compounds of General Formula I were screened for their ability to inhibit wild type and V804M mutant RET kinase using CisBio's HTRF® KinEASE¿-TK ...
Ligand InfoPC cidPC sid
In DepthDetails US Patent
TargetProto-oncogene tyrosine-protein kinase receptor Ret [V804M](Homo sapiens (Human))
Array Biopharma
US Patent
LigandPNGBDBM284352(6-(1-methyl-1H-pyrazol- 4-yl)-4-(6-(4-(2- morpholi...)
Affinity DataIC50:  169nM. Assay description: Compounds of General Formula I were screened for their ability to inhibit wild type and V804M mutant RET kinase using CisBio's HTRF® KinEASE-TK a...
Ligand InfoPC cidPC sid
In DepthDetails US Patent
TargetProto-oncogene tyrosine-protein kinase receptor Ret(Homo sapiens (Human))
Array Biopharma
US Patent
LigandPNGBDBM284352(6-(1-methyl-1H-pyrazol- 4-yl)-4-(6-(4-(2- morpholi...)
Affinity DataIC50:  19.9nM. Assay description: Compounds of General Formula I were screened for their ability to inhibit wild type and V804M mutant RET kinase using CisBio's HTRF® KinEASE¿-TK ...
Ligand InfoPC cidPC sid
In DepthDetails US Patent
TargetProto-oncogene tyrosine-protein kinase receptor Ret(Homo sapiens (Human))
Array Biopharma
US Patent
LigandPNGBDBM284352(6-(1-methyl-1H-pyrazol- 4-yl)-4-(6-(4-(2- morpholi...)
Affinity DataIC50:  19.9nM. Assay description: Compounds of General Formula I were screened for their ability to inhibit wild type and V804M mutant RET kinase using CisBio's HTRF® KinEASE-TK a...
Ligand InfoPC cidPC sid
In DepthDetails US Patent