BDBM284389 4-(6-(4-((6- methoxypyridin-2- yl)methyl)piperazin-1- yl)pyridin-3-yl)-6-(1- methyl-1H-pyrazol-4- yl)pyrazolo[1,5-a]pyridine- 3-carbonitrile::US10023570, Example 399::US10174027, Example 399
SMILES COc1cccc(CN2CCN(CC2)c2ccc(cn2)-c2cc(cn3ncc(C#N)c23)-c2cnn(C)c2)n1
InChI Key InChIKey=HWLKSLADFRDAEP-UHFFFAOYSA-N
Data  6 IC50
  Tab Delimited (TSV)   2D SDfile   Computed 3D by Vconf -m prep SDfile
Find this compound or compounds like it in BindingDB:
Activity Spreadsheet -- Enzyme Inhibition Constant Data from BindingDB
Found 6 hits for monomerid = 284389
TargetProto-oncogene tyrosine-protein kinase receptor Ret [658-1114](Homo sapiens (Human))
Array Biopharma
US Patent
LigandPNGBDBM284389(4-(6-(4-((6- methoxypyridin-2- yl)methyl)piperazin...)
Affinity DataIC50:  10.8nMpH: 7.4Assay Description:Compounds of General Formula I were screened for their ability to inhibit wild type and V804M mutant RET kinase using CisBio's HTRF® KinEASE -TK ...
Ligand InfoPC cidPC sid
In DepthDetails US Patent
TargetProto-oncogene tyrosine-protein kinase receptor Ret [658-1114,V804M](Homo sapiens (Human))
Array Biopharma
US Patent
LigandPNGBDBM284389(4-(6-(4-((6- methoxypyridin-2- yl)methyl)piperazin...)
Affinity DataIC50:  34.9nMpH: 7.4Assay Description:Compounds of General Formula I were screened for their ability to inhibit wild type and V804M mutant RET kinase using CisBio's HTRF® KinEASE -TK ...
Ligand InfoPC cidPC sid
In DepthDetails US Patent
TargetProto-oncogene tyrosine-protein kinase receptor Ret [V804M](Homo sapiens (Human))
Array Biopharma
US Patent
LigandPNGBDBM284389(4-(6-(4-((6- methoxypyridin-2- yl)methyl)piperazin...)
Affinity DataIC50:  34.9nM. Assay description: Compounds of General Formula I were screened for their ability to inhibit wild type and V804M mutant RET kinase using CisBio's HTRF® KinEASE¿-TK ...
Ligand InfoPC cidPC sid
In DepthDetails US Patent
TargetProto-oncogene tyrosine-protein kinase receptor Ret [V804M](Homo sapiens (Human))
Array Biopharma
US Patent
LigandPNGBDBM284389(4-(6-(4-((6- methoxypyridin-2- yl)methyl)piperazin...)
Affinity DataIC50:  34.9nM. Assay description: Compounds of General Formula I were screened for their ability to inhibit wild type and V804M mutant RET kinase using CisBio's HTRF® KinEASE-TK a...
Ligand InfoPC cidPC sid
In DepthDetails US Patent
TargetProto-oncogene tyrosine-protein kinase receptor Ret(Homo sapiens (Human))
Array Biopharma
US Patent
LigandPNGBDBM284389(4-(6-(4-((6- methoxypyridin-2- yl)methyl)piperazin...)
Affinity DataIC50:  10.8nM. Assay description: Compounds of General Formula I were screened for their ability to inhibit wild type and V804M mutant RET kinase using CisBio's HTRF® KinEASE¿-TK ...
Ligand InfoPC cidPC sid
In DepthDetails US Patent
TargetProto-oncogene tyrosine-protein kinase receptor Ret(Homo sapiens (Human))
Array Biopharma
US Patent
LigandPNGBDBM284389(4-(6-(4-((6- methoxypyridin-2- yl)methyl)piperazin...)
Affinity DataIC50:  10.8nM. Assay description: Compounds of General Formula I were screened for their ability to inhibit wild type and V804M mutant RET kinase using CisBio's HTRF® KinEASE-TK a...
Ligand InfoPC cidPC sid
In DepthDetails US Patent