BDBM284845 4-(6-(4-amino-5-(1-cyclohexyl-1H-1,2,3-triazol-5-yl)pyrrolo [2,1-f][1,2,4]triazin-7-yl)-1H-indazol-1-yl)tetrahydro-2H- thiopyran 1,1-dioxide::US10023576, Example 35
SMILES Nc1ncnn2c(cc(-c3cnnn3C3CCCCC3)c12)-c1ccc2cnn(C3CCS(=O)(=O)CC3)c2c1
InChI Key InChIKey=VCYMXQCRCSBZHB-UHFFFAOYSA-N
Data  1 IC50
  Tab Delimited (TSV)   2D SDfile   Computed 3D by Vconf -m prep SDfile
Find this compound or compounds like it in BindingDB:
Activity Spreadsheet -- Enzyme Inhibition Constant Data from BindingDB
Found 1 hit for monomerid = 284845
TargetPhosphatidylinositol 4,5-bisphosphate 3-kinase catalytic subunit delta isoform(Homo sapiens (Human))
Bristol-Myers Squibb
US Patent
LigandPNGBDBM284845(4-(6-(4-amino-5-(1-cyclohexyl-1H-1,2,3-triazol-5-y...)
Affinity DataIC50:  4nMpH: 7.5 T: 2°C. Assay description: The ADP-Glo format PI3K assays were performed in Proxiplate 384-well plates (Perkin Elmer #6008280). The final assay volume was 2 μl prepared fr...
Ligand InfoPC cidPC sid
In DepthDetails US Patent