BDBM284963 BDBM485805::N-[[3-(2-methyl-1-oxoisoquinolin-4-yl) phenyl]methyl]methanesulfonamide::US10023592, Example 8
SMILES Cn1cc(-c2cccc(CNS(C)(=O)=O)c2)c2ccccc2c1=O
InChI Key InChIKey=BZOKPFNDBIFYQS-UHFFFAOYSA-N
Data  3 IC50
  Tab Delimited (TSV)   2D SDfile   Computed 3D by Vconf -m prep SDfile
Find this compound or compounds like it in BindingDB:
Activity Spreadsheet -- Enzyme Inhibition Constant Data from BindingDB
Found 3 hits for monomerid = 284963
TargetBromodomain-containing protein 4(Homo sapiens (Human))
Celgene Quanticel Research
US Patent
LigandPNGBDBM284963(BDBM485805 | N-[[3-(2-methyl-1-oxoisoquinolin-4-yl...)
Affinity DataIC50:  2.75E+3nMpH: 7.3Assay Description:Determination of the IC50 for the heterocyclic derivative BRD4 inhibitors disclosed herein was performed as follows. His-tagged BRD4 was cloned, expr...
Ligand InfoPC cidPC sid
In DepthDetails US Patent
TargetBromodomain-containing protein 4(Homo sapiens (Human))
Celgene Quanticel Research
US Patent
LigandPNGBDBM284963(BDBM485805 | N-[[3-(2-methyl-1-oxoisoquinolin-4-yl...)
Affinity DataIC50:  2.75E+3nM. Assay description: Determination of the IC50 for the heterocyclic derivative BRD4 inhibitors disclosed herein was performed as follows. His-tagged BRD4 was cloned, expr...
Ligand InfoPC cidPC sid
In DepthDetails US Patent
TargetBromodomain-containing protein 4(Homo sapiens (Human))
Celgene Quanticel Research
US Patent
LigandPNGBDBM284963(BDBM485805 | N-[[3-(2-methyl-1-oxoisoquinolin-4-yl...)
Affinity DataIC50:  750nM. Assay description: Inhibition of His-tagged human BRD4-BD1 using H4K5acK8acK12acK16ac as substrate preincubated for 30 mins followed by substrate addition measured afte...
Ligand InfoPC cidPC sid
In DepthDetails ArticlePubMed