BDBM285034 4-(5-ethylsulfonyl-2-methoxyphenyl)-2- methyl-6-(1-methylpyrazol-4-yl)isoquinolin- 1-one::US10023592, Example 79
SMILES CCS(=O)(=O)c1ccc(OC)c(c1)-c1cn(C)c(=O)c2ccc(cc12)-c1cnn(C)c1
InChI Key InChIKey=VFQXMHYHBXHDCR-UHFFFAOYSA-N
Data  3 IC50
PDB links: 1 PDB ID matches this monomer.
  Tab Delimited (TSV)   2D SDfile   Computed 3D by Vconf -m prep SDfile
Find this compound or compounds like it in BindingDB:
Activity Spreadsheet -- Enzyme Inhibition Constant Data from BindingDB
Found 3 hits for monomerid = 285034
TargetBromodomain-containing protein 4(Homo sapiens (Human))
Celgene Quanticel Research
US Patent
LigandPNGBDBM285034(4-(5-ethylsulfonyl-2-methoxyphenyl)-2- methyl-6-(1...)
Affinity DataIC50: <500nMpH: 7.3Assay Description:Determination of the IC50 for the heterocyclic derivative BRD4 inhibitors disclosed herein was performed as follows. His-tagged BRD4 was cloned, expr...
Ligand InfoPC cidPC sidPDB
TargetBromodomain-containing protein 4(Homo sapiens (Human))
Celgene Quanticel Research
US Patent
LigandPNGBDBM285034(4-(5-ethylsulfonyl-2-methoxyphenyl)-2- methyl-6-(1...)
Affinity DataIC50:  15nM. Assay description: Inhibition of His-tagged human BRD4-BD1 using H4K5acK8acK12acK16ac as substrate preincubated for 30 mins followed by substrate addition measured afte...
Ligand InfoPC cidPC sidPDB
TargetBromodomain-containing protein 4(Homo sapiens (Human))
Celgene Quanticel Research
US Patent
LigandPNGBDBM285034(4-(5-ethylsulfonyl-2-methoxyphenyl)-2- methyl-6-(1...)
Affinity DataIC50:  65nM. Assay description: Inhibition of BRD4-BD1 in human Raji cells assessed as downregulation of MYC gene expression by PCR method
Ligand InfoPC cidPC sidPDB