BDBM285717 US10077289, Compound 25::[(2S,3R,4R)-3-Hydroxy-4-methyl-2-(methylamino)-7-(1-methylpyrazol-3-yl) heptanoic acid]1 [(R)-methyl-Sar]3 cyclosporin A
SMILES CC[C@H]1NC(=O)[C@@H]([C@H](O)[C@H](C)CCCc2ccn(C)n2)N(C)C(=O)[C@@H](C(C)C)N(C)C(=O)[C@@H](CC(C)C)N(C)C(=O)[C@@H](CC(C)C)N(C)C(=O)[C@H](C)NC(=O)[C@@H](C)NC(=O)[C@@H](CC(C)C)N(C)C(=O)[C@H](NC(=O)[C@H](CC(C)C)N(C)C(=O)[C@@H](C)N(C)C1=O)C(C)C
InChI Key InChIKey=UQPPGSWGYIDVBM-IOAMBDKWSA-N
Data  1 KI  1 IC50
  Tab Delimited (TSV)   2D SDfile   Computed 3D by Vconf -m prep SDfile
Find this compound or compounds like it in BindingDB:
Activity Spreadsheet -- Enzyme Inhibition Constant Data from BindingDB
Found 2 hits for monomerid = 285717
TargetPeptidyl-prolyl cis-trans isomerase A(Homo sapiens (Human))
Allergan
US Patent
LigandPNGBDBM285717(US10077289, Compound 25 | [(2S,3R,4R)-3-Hydroxy-4-...)
Affinity DataKi:  3.80nMpH: 7.8Assay Description:The protease-free PPIase assay measures the rate of cis to trans conversion of a peptide substrate catalyzed by the enzyme cyclophilin A. Addition of...
Ligand InfoPC cidPC sid
In DepthDetails US Patent
LigandPNGBDBM285717(US10077289, Compound 25 | [(2S,3R,4R)-3-Hydroxy-4-...)
Affinity DataIC50:  230nM. Assay description: Enzo Life Sciences CaN Assay Kit: BML-AK8042x assay buffer: 100 mM Tris, pH7.5, 200 mM NaCl, 12 mM MgCl2, 1 mM DTT, 0.05% NP-40, 1 mM CaCl2
Ligand InfoPC cidPC sid
In DepthDetails US Patent