BDBM285840 (6R,7R,8S)-8-(but-1-yn-1-yl)-4-azaspiro[2.5]octane-6,7-diol::US10081601, Example 22::US9796680, Example 22
SMILES CCC#C[C@@H]1[C@@H](O)[C@H](O)CNC11CC1
InChI Key InChIKey=RUUGSGCVICOVQG-OPRDCNLKSA-N
Data  2 IC50
  Tab Delimited (TSV)   2D SDfile   Computed 3D by Vconf -m prep SDfile
Find this compound or compounds like it in BindingDB:
Activity Spreadsheet -- Enzyme Inhibition Constant Data from BindingDB
Found 2 hits for monomerid = 285840
TargetLysosomal acid glucosylceramidase(Homo sapiens (Human))
Alectos Therapeutics
US Patent
LigandPNGBDBM285840((6R,7R,8S)-8-(but-1-yn-1-yl)-4-azaspiro[2.5]octane...)
Affinity DataIC50:  2.40nM. Assay description: Various concentrations of test compounds were prepared in DMSO and then diluted into buffer consisting of 50 mM sodium phosphate 0.25% w/v sodium tau...
Ligand InfoPC cidPC sid
In DepthDetails US Patent
TargetLysosomal acid glucosylceramidase(Homo sapiens (Human))
Alectos Therapeutics
US Patent
LigandPNGBDBM285840((6R,7R,8S)-8-(but-1-yn-1-yl)-4-azaspiro[2.5]octane...)
Affinity DataIC50:  2.40nMpH: 7.0Assay Description:Various concentrations of test compounds were prepared in DMSO and then diluted into buffer consisting of 50 mM sodium phosphate 0.25% w/v sodium tau...
Ligand InfoPC cidPC sid
In DepthDetails US Patent