BDBM286030 N-(2-(4-Chlorophenyl)-1-methyl-1H-indol-5-yl-2-(difluoromethyl)-5-((2-methylpropanoylamino)methyl)nicotinamide::US10081629, Example 13
SMILES CC(C)C(=O)NCc1cnc(C(F)F)c(c1)C(=O)Nc1ccc2n(C)c(cc2c1)-c1ccc(Cl)cc1
InChI Key InChIKey=YUIOGBYMKCNGAS-UHFFFAOYSA-N
Data  2 IC50
  Tab Delimited (TSV)   2D SDfile   Computed 3D by Vconf -m prep SDfile
Find this compound or compounds like it in BindingDB:
Activity Spreadsheet -- Enzyme Inhibition Constant Data from BindingDB
Found 2 hits for monomerid = 286030
TargetProstaglandin E synthase(Homo sapiens (Human))
Jiangsu Hengrui Medicine
US Patent
LigandPNGBDBM286030(N-(2-(4-Chlorophenyl)-1-methyl-1H-indol-5-yl-2-(di...)
Affinity DataIC50:  16.7nM. Assay description: mPGES1 was diluted with assay buffer and added into plate at 49 μL/well supplemented with 1 μL of compound (the final concentration of each...
Ligand InfoPC cidPC sid
In DepthDetails US Patent
TargetProstaglandin E synthase(Homo sapiens (Human))
Jiangsu Hengrui Medicine
US Patent
LigandPNGBDBM286030(N-(2-(4-Chlorophenyl)-1-methyl-1H-indol-5-yl-2-(di...)
Affinity DataIC50:  7.43nM. Assay description: mPGES1 was diluted with assay buffer and added into plate at 49 μL/well supplemented with 1 μL of compound (the final concentration of each...
Ligand InfoPC cidPC sid
In DepthDetails US Patent