BDBM286110 4-(4-((5-chloro- 2,2-dimethyl- 2,3-dihydro- benzofuran-7- yl)methoxy) bicyclo[2.2.1] heptan-1-yl) butanoic acid::US9518000, Example 3
SMILES CC1(C)Cc2cc(Cl)cc(COC34CCC(CCCC(O)=O)(CC3)C4)c2O1
InChI Key InChIKey=VQKDYXNAGPZUIP-UHFFFAOYSA-N
Data  1 EC50
  Tab Delimited (TSV)   2D SDfile   Computed 3D by Vconf -m prep SDfile
Find this compound or compounds like it in BindingDB:
Activity Spreadsheet -- Enzyme Inhibition Constant Data from BindingDB
Found 1 hit for monomerid = 286110
TargetFree fatty acid receptor 4(Homo sapiens (Human))
Bristol-Myers Squibb
US Patent
LigandPNGBDBM286110(4-(4-((5-chloro- 2,2-dimethyl- 2,3-dihydro- benzof...)
Affinity DataEC50:  530nMT: 2°C. Assay description: The human and mouse GPR120-mediated intracellular phosphorylated ERK assays were established using CHOA12 cells stably transfected with the short for...
Ligand InfoPC cidPC sid
In DepthDetails US Patent