BDBM28655 2-(5-butoxy-1-oxo-1,2-dihydroisoquinolin-2-yl)-N-(2,3-dihydro-1,4-benzodioxin-6-yl)acetamide::cid_23640021::isoquinolinone scaffold, 14
SMILES CCCCOc1cccc2c1ccn(CC(=O)Nc1ccc3OCCOc3c1)c2=O
InChI Key InChIKey=TWUUAAGXROMAKI-UHFFFAOYSA-N
Data  1 IC50  1 EC50
  Tab Delimited (TSV)   2D SDfile   Computed 3D by Vconf -m prep SDfile
Find this compound or compounds like it in BindingDB:
Activity Spreadsheet -- Enzyme Inhibition Constant Data from BindingDB
Found 2 hits for monomerid = 28655
TargetADP-ribosylation factor GTPase-activating protein 1(Rattus norvegicus)
The Scripps Research Institute Molecular Screening Center
Curated by PubChem BioAssay
LigandPNGBDBM28655(2-(5-butoxy-1-oxo-1,2-dihydroisoquinolin-2-yl)-N-(...)
Affinity DataIC50:  3.68E+4nM
In DepthDetails PCBioAssay
TargetSteroidogenic factor 1(Homo sapiens (Human))
Scripps Florida
LigandPNGBDBM28655(2-(5-butoxy-1-oxo-1,2-dihydroisoquinolin-2-yl)-N-(...)
Affinity DataEC50:  1.37E+4nM. Assay description: The assay was to monitor the SF-1 activation state via co-transfection of CHO-K1 cells with a plasmid encoding a Gal4-SF-1 chimerical transcription f...
In DepthDetails ArticlePubMed