BDBM286680 3-(2,4-Dioxo-7-piperazin-1-ylmethyl-6-trifluoromethyl-1,4-dihydro-2H-quinazolin-3-ylmethyl)-4-ethanesulfonyl-benzonitrile::US9567304, Compound B-10
SMILES CCS(=O)(=O)c1ccc(cc1Cn1c(=O)[nH]c2cc(CN3CCNCC3)c(cc2c1=O)C(F)(F)F)C#N
InChI Key InChIKey=HFDBBIXWGGGXEE-UHFFFAOYSA-N
Data  1 IC50
  Tab Delimited (TSV)   2D SDfile   Computed 3D by Vconf -m prep SDfile
Find this compound or compounds like it in BindingDB:
Activity Spreadsheet -- Enzyme Inhibition Constant Data from BindingDB
Found 1 hit for monomerid = 286680
TargetEpithelial discoidin domain-containing receptor 1(Homo sapiens (Human))
Chugai Seiyaku Kabushiki Kaisha
US Patent
LigandPNGBDBM286680(3-(2,4-Dioxo-7-piperazin-1-ylmethyl-6-trifluoromet...)
Affinity DataIC50:  100nMT: 2°C. Assay description: DDR1 binding activity was measured using the LanthaScreen(Registered trademark) Eu Kinase Binding Assay (manufactured by Life Technologies Corporatio...
Ligand InfoPC cidPC sid
In DepthDetails US Patent