BDBM286715 6-Bromo-3-(5-chloro-2-ethanesulfonyl-benzyl)-7-(4-isopropyl-piperazin-1-ylmethyl)-1H-quinazoline-2,4-dione::US9567304, Compound E-3
SMILES CCS(=O)(=O)c1ccc(Cl)cc1Cn1c(=O)[nH]c2cc(CN3CCN(CC3)C(C)C)c(Br)cc2c1=O
InChI Key InChIKey=KBTZUTBJPPTAFR-UHFFFAOYSA-N
Data  1 IC50
  Tab Delimited (TSV)   2D SDfile   Computed 3D by Vconf -m prep SDfile
Find this compound or compounds like it in BindingDB:
Activity Spreadsheet -- Enzyme Inhibition Constant Data from BindingDB
Found 1 hit for monomerid = 286715
TargetEpithelial discoidin domain-containing receptor 1(Homo sapiens (Human))
Chugai Seiyaku Kabushiki Kaisha
US Patent
LigandPNGBDBM286715(6-Bromo-3-(5-chloro-2-ethanesulfonyl-benzyl)-7-(4-...)
Affinity DataIC50:  33nMT: 2°C. Assay description: DDR1 binding activity was measured using the LanthaScreen(Registered trademark) Eu Kinase Binding Assay (manufactured by Life Technologies Corporatio...
Ligand InfoPC cidPC sid
In DepthDetails US Patent