BDBM287265 US9567339, Example A.13.1
SMILES Cc1c(cccc1-n1cnc2ccccc2c1=O)-c1ccc(C(N)=O)c2[nH]c(cc12)-c1cncnc1
InChI Key InChIKey=HLLWUYRSVBFCPR-UHFFFAOYSA-N
Data  1 IC50
  Tab Delimited (TSV)   2D SDfile   Computed 3D by Vconf -m prep SDfile
Find this compound or compounds like it in BindingDB:
Activity Spreadsheet -- Enzyme Inhibition Constant Data from BindingDB
Found 1 hit for monomerid = 287265
TargetTyrosine-protein kinase BTK [393-659](Homo sapiens (Human))
Abbvie
US Patent
LigandPNGBDBM287265(US9567339, Example A.13.1)
Affinity DataIC50:  550nMpH: 6.5 T: 2°C. Assay description: The in-house BTK corresponds to recombinant human catalytic domain (aa 393-659), which was expressed in SF9 cells with an N-terminal his tag and puri...
Ligand InfoPC cidPC sid
In DepthDetails US Patent