BDBM287293 US9567339, Example D.5.1
SMILES CC(=O)N1CCC(CC1)c1cc2c(ccc(C(N)=O)c2[nH]1)-c1cccc(NC(=O)c2ccc(cc2)C2CC2)c1C
InChI Key InChIKey=XHRMCHBCISVRLG-UHFFFAOYSA-N
Data  1 IC50
  Tab Delimited (TSV)   2D SDfile   Computed 3D by Vconf -m prep SDfile
Find this compound or compounds like it in BindingDB:
Activity Spreadsheet -- Enzyme Inhibition Constant Data from BindingDB
Found 1 hit for monomerid = 287293
TargetTyrosine-protein kinase BTK [393-659](Homo sapiens (Human))
Abbvie
US Patent
LigandPNGBDBM287293(US9567339, Example D.5.1)
Affinity DataIC50:  550nMpH: 6.5 T: 2°C. Assay description: The in-house BTK corresponds to recombinant human catalytic domain (aa 393-659), which was expressed in SF9 cells with an N-terminal his tag and puri...
Ligand InfoPC cidPC sid
In DepthDetails US Patent