BDBM288081 N-(3-chloro-2-fluorobenzyl)- 9'-hydroxy-cis-3-isopropoxy- 2'-methyl-1',8'-dioxo- 1',2',3',8'- tetrahydrospiro[cyclobutane- 1,4'-pyrido[1,2-a]pyrazine]- 7'-carboxamide hydrochloride::US10087178, Example S41
SMILES CC(C)O[C@H]1C[C@@]2(C1)CN(C)C(=O)c1c(O)c(=O)c(cn21)C(=O)NCc1cccc(Cl)c1F
InChI Key InChIKey=KLVXJFDMKKDZPU-GPCKLQJOSA-N
Data  1 EC50
  Tab Delimited (TSV)   2D SDfile   Computed 3D by Vconf -m prep SDfile
Find this compound or compounds like it in BindingDB:
Activity Spreadsheet -- Enzyme Inhibition Constant Data from BindingDB
Found 1 hit for monomerid = 288081
TargetProtein Nef(Human immunodeficiency virus type 1 (isolate BRU/L...)
Japan Tobacco
US Patent
LigandPNGBDBM288081(N-(3-chloro-2-fluorobenzyl)- 9'-hydroxy-cis-3-isop...)
Affinity DataEC50:  3.5nMT: 2°C. Assay description: The medium (40 μL), a test substance (10 μL) diluted with the medium, and a 1×105 cells/mL MT-4 cell suspension (50 μL) wherein HIV-1 ...
Ligand InfoPC cidPC sid
In DepthDetails US Patent