BDBM288122 US10087178, Example 40
SMILES COC[C@H]1C[C@@]2(C1)CN(C)C(=O)c1c(OC(=O)c3cccc(c3)C([O-])=O)c(=O)c(cn21)C(=O)NCc1cccc(Cl)c1F
InChI Key InChIKey=YZSXIBMVXZEJNK-LEXOZZQHSA-M
Data  1 EC50
  Tab Delimited (TSV)   2D SDfile   Computed 3D by Vconf -m prep SDfile
Find this compound or compounds like it in BindingDB:
Activity Spreadsheet -- Enzyme Inhibition Constant Data from BindingDB
Found 1 hit for monomerid = 288122
TargetProtein Nef(Human immunodeficiency virus type 1 (isolate BRU/L...)
Japan Tobacco
US Patent
LigandPNGBDBM288122(US10087178, Example 40)
Affinity DataEC50:  1nMT: 2°C. Assay description: The medium (40 μL), a test substance (10 μL) diluted with the medium, and a 1×105 cells/mL MT-4 cell suspension (50 μL) wherein HIV-1 ...
Ligand InfoPC cidPC sid
In DepthDetails US Patent