BDBM288152 (1R,2R)-N-(3-chloro-2- fluorobenzyl)-2'-ethyl-9'- hydroxy-2-(methoxymethyl)- 1',8'-dioxo-1',2',3',8'- tetrahydrospiro[cyclopropane- 1,4'-pyrido[1,2-a]pyrazine]- 7'-carboxamide hydrochloride::US10087178, Example T20
SMILES CCN1C[C@]2(C[C@H]2COC)n2cc(C(=O)NCc3cccc(Cl)c3F)c(=O)c(O)c2C1=O
InChI Key InChIKey=PITVRIPHZKVXBB-XMHCIUCPSA-N
Data  1 EC50
  Tab Delimited (TSV)   2D SDfile   Computed 3D by Vconf -m prep SDfile
Find this compound or compounds like it in BindingDB:
Activity Spreadsheet -- Enzyme Inhibition Constant Data from BindingDB
Found 1 hit for monomerid = 288152
TargetProtein Nef(Human immunodeficiency virus type 1 (isolate BRU/L...)
Japan Tobacco
US Patent
LigandPNGBDBM288152((1R,2R)-N-(3-chloro-2- fluorobenzyl)-2'-ethyl-9'- ...)
Affinity DataEC50:  3.5nMT: 2°C. Assay description: The medium (40 μL), a test substance (10 μL) diluted with the medium, and a 1×105 cells/mL MT-4 cell suspension (50 μL) wherein HIV-1 ...
Ligand InfoPC cidPC sid
In DepthDetails US Patent