BDBM288318 US10087187, Compound 11
SMILES Cc1nc2c(cc(nn2c1Cc1cccc(Cl)c1C)N1CCOCC1)C(N)=O
InChI Key InChIKey=QXWVMUFGHIYGME-UHFFFAOYSA-N
Data  5 Kd
  Tab Delimited (TSV)   2D SDfile   Computed 3D by Vconf -m prep SDfile
Find this compound or compounds like it in BindingDB:
Activity Spreadsheet -- Enzyme Inhibition Constant Data from BindingDB
Found 5 hits for monomerid = 288318
TargetPhosphatidylinositol 4-phosphate 3-kinase C2 domain-containing subunit alpha(Homo sapiens (Human))
Janssen Pharmaceutica
US Patent
LigandPNGBDBM288318(US10087187, Compound 11)
Affinity DataKd:  2.69E+3nM. Assay description: Kinase enzyme binding affinities of compounds disclosed herein were determined using the KINOMEscan technology performed by DiscoveRx Corporation, Sa...
Ligand InfoPC cidPC sid
In DepthDetails US Patent
TargetPhosphatidylinositol 4-phosphate 3-kinase C2 domain-containing subunit beta(Homo sapiens (Human))
Janssen Pharmaceutica
US Patent
LigandPNGBDBM288318(US10087187, Compound 11)
Affinity DataKd:  21nM. Assay description: Kinase enzyme binding affinities of compounds disclosed herein were determined using the KINOMEscan technology performed by DiscoveRx Corporation, Sa...
Ligand InfoPC cidPC sid
In DepthDetails US Patent
TargetSerine/threonine-protein kinase mTOR(Homo sapiens (Human))
Janssen Pharmaceutica
US Patent
LigandPNGBDBM288318(US10087187, Compound 11)
Affinity DataKd:  2.24E+4nM. Assay description: Kinase enzyme binding affinities of compounds disclosed herein were determined using the KINOMEscan technology performed by DiscoveRx Corporation, Sa...
Ligand InfoPC cidPC sid
In DepthDetails US Patent
TargetPhosphatidylinositol 4,5-bisphosphate 3-kinase catalytic subunit gamma isoform(Homo sapiens (Human))
Janssen Pharmaceutica
US Patent
LigandPNGBDBM288318(US10087187, Compound 11)
Affinity DataKd:  6.92E+3nM. Assay description: Kinase enzyme binding affinities of compounds disclosed herein were determined using the KINOMEscan technology performed by DiscoveRx Corporation, Sa...
Ligand InfoPC cidPC sid
In DepthDetails US Patent
TargetPhosphatidylinositol 4,5-bisphosphate 3-kinase catalytic subunit delta isoform(Homo sapiens (Human))
Janssen Pharmaceutica
US Patent
LigandPNGBDBM288318(US10087187, Compound 11)
Affinity DataKd:  955nM. Assay description: Kinase enzyme binding affinities of compounds disclosed herein were determined using the KINOMEscan technology performed by DiscoveRx Corporation, Sa...
Ligand InfoPC cidPC sid
In DepthDetails US Patent