BDBM288746 US10092551, Example 54
SMILES Oc1ccc2\C(CCc2c1)=C1/SC(=NC1=O)N1CCC2(CC1)OCc1ccccc21
InChI Key InChIKey=ROZVWWFTHNRYRZ-VZCXRCSSSA-N
Data  1 KI
  Tab Delimited (TSV)   2D SDfile   Computed 3D by Vconf -m prep SDfile
Find this compound or compounds like it in BindingDB:
Activity Spreadsheet -- Enzyme Inhibition Constant Data from BindingDB
Found 1 hit for monomerid = 288746
TargetVasopressin V1a receptor(Homo sapiens (Human))
Hoffmann-La Roche
US Patent
LigandPNGBDBM288746(US10092551, Example 54)
Affinity DataKi:  31.6nM ΔG°:  -10.2kcal/moleT: 2°C. Assay description: The human V1a receptor was cloned by RT-PCR from total human liver RNA. The coding sequence was subcloned in an expression vector after sequencing to...
Ligand InfoPC cidPC sid
In DepthDetails US Patent