BDBM289837 N-((2S)-1-(6-chloro-2-oxo-1,2-dihydrospiro[benzo[d][1,3]oxazine-4,3′-pyrrolidin]-1′-yl)-1-oxo-3-phenylpropan-2-yl)-4-sulfamoylbenzamide::US10093683, Example 139
SMILES NS(=O)(=O)c1ccc(cc1)C(=O)N[C@@H](Cc1ccccc1)C(=O)N1CCC2(C1)OC(=O)Nc1ccc(Cl)cc21
InChI Key InChIKey=QDOZXTIBOJGGML-DCCUJTHKSA-N
Data  1 KI
  Tab Delimited (TSV)   2D SDfile   Computed 3D by Vconf -m prep SDfile
Find this compound or compounds like it in BindingDB:
Activity Spreadsheet -- Enzyme Inhibition Constant Data from BindingDB
Found 1 hit for monomerid = 289837
TargetCoagulation factor XI(Homo sapiens (Human))
Merck Sharp & Dohme
US Patent
LigandPNGBDBM289837(N-((2S)-1-(6-chloro-2-oxo-1,2-dihydrospiro[benzo[d...)
Affinity DataKi:  928nM ΔG°:  -8.22kcal/molepH: 7.4 T: 2°C. Assay description: The effectiveness of a compound of the present invention as an inhibitor of Coagulation Factor XIa can be determined using a relevant purified serine...
Ligand InfoPC cidPC sid
In DepthDetails US Patent