BDBM29037 cyanohydroxybutenamide, 27
SMILES CC(=O)C(C#N)C(=O)Nc1ccc(cc1)-c1ccccc1Cl
InChI Key InChIKey=ADPQXEJAINAZRY-UHFFFAOYSA-N
Data  2 KI  2 IC50
  Tab Delimited (TSV)   2D SDfile   Computed 3D by Vconf -m prep SDfile
Find this compound or compounds like it in BindingDB:
Activity Spreadsheet -- Enzyme Inhibition Constant Data from BindingDB
Found 2 hits for monomerid = 29037
TargetDihydroorotate dehydrogenase (quinone), mitochondrial(Homo sapiens (Human))
University Of Leeds
LigandPNGBDBM29037(cyanohydroxybutenamide, 27)
Affinity DataKi:  16nM IC50:  130nM. Assay description: The assays were carried out by using a colorimetric DCIP method, which uses the colorimetric reagent 2, 6-dichlorophenolindophenol as the final elect...
In DepthDetails ArticlePubMed
TargetDihydroorotate dehydrogenase (quinone), mitochondrial(Plasmodium falciparum (isolate 3D7))
University Of Leeds
LigandPNGBDBM29037(cyanohydroxybutenamide, 27)
Affinity DataKi:  5.60E+3nM ΔG°:  -7.16kcal/mole IC50:  4.74E+4nMpH: 8.0 T: 2°C. Assay description: The assays were carried out by using a colorimetric DCIP method, which uses the colorimetric reagent 2, 6-dichlorophenolindophenol as the final elect...
In DepthDetails ArticlePubMed