BDBM290394 (3R,4S)-3-amino-4-(3-boronopropyl)-1-(4- carboxycyclohexyl)pyrrolidine-3-carboxylic acid::US10098902, Example 30::US10603330, Example 30::US11389464, Example 30
SMILES N[C@]1(CN(C[C@@H]1CCCB(O)O)C1CCCCC1)C(O)=O
InChI Key InChIKey=LYOGEGAZOHQYTL-FZMZJTMJSA-N
Data  6 IC50
  Tab Delimited (TSV)   2D SDfile   Computed 3D by Vconf -m prep SDfile
Find this compound or compounds like it in BindingDB:
Activity Spreadsheet -- Enzyme Inhibition Constant Data from BindingDB
Found 6 hits for monomerid = 290394
TargetArginase-1(Homo sapiens (Human))
Mars
US Patent
LigandPNGBDBM290394((3R,4S)-3-amino-4-(3-boronopropyl)-1-(4- carboxycy...)
Affinity DataIC50:  625nMpH: 7.4 T: 2°C. Assay description: Inhibition of arginase I (ARG I) and arginase II (ARG II) by Formula I or Formula II compounds is followed spectrophotometrically at 530 nm. The comp...
Ligand InfoPC cidPC sid
In DepthDetails US Patent
TargetArginase-2, mitochondrial(Homo sapiens (Human))
Mars
US Patent
LigandPNGBDBM290394((3R,4S)-3-amino-4-(3-boronopropyl)-1-(4- carboxycy...)
Affinity DataIC50:  1.50E+3nMpH: 7.4 T: 2°C. Assay description: Inhibition of arginase I (ARG I) and arginase II (ARG II) by Formula I or Formula II compounds is followed spectrophotometrically at 530 nm. The comp...
Ligand InfoPC cidPC sid
In DepthDetails US Patent
TargetArginase-2, mitochondrial(Homo sapiens (Human))
Mars
US Patent
LigandPNGBDBM290394((3R,4S)-3-amino-4-(3-boronopropyl)-1-(4- carboxycy...)
Affinity DataIC50:  1.50E+3nM
Ligand InfoPC cidPC sid
In DepthDetails US Patent
TargetArginase-2, mitochondrial(Homo sapiens (Human))
Mars
US Patent
LigandPNGBDBM290394((3R,4S)-3-amino-4-(3-boronopropyl)-1-(4- carboxycy...)
Affinity DataIC50:  3.00E+3nM. Assay description: Inhibition of arginase I (ARG I) and arginase II (ARG II) by Formula I or Formula II compounds is followed spectrophotometrically at 530 nm. The comp...
Ligand InfoPC cidPC sid
In DepthDetails US Patent
TargetArginase-1(Homo sapiens (Human))
Mars
US Patent
LigandPNGBDBM290394((3R,4S)-3-amino-4-(3-boronopropyl)-1-(4- carboxycy...)
Affinity DataIC50:  625nM. Assay description: Inhibition of arginase I (ARG I) and arginase II (ARG II) by Formula I or Formula II compounds is followed spectrophotometrically at 530 nm. The comp...
Ligand InfoPC cidPC sid
In DepthDetails US Patent
TargetArginase-1(Homo sapiens (Human))
Mars
US Patent
LigandPNGBDBM290394((3R,4S)-3-amino-4-(3-boronopropyl)-1-(4- carboxycy...)
Affinity DataIC50:  2.00E+3nM. Assay description: Inhibition of arginase I (ARG I) and arginase II (ARG II) by Formula I or Formula II compounds is followed spectrophotometrically at 530 nm. The comp...
Ligand InfoPC cidPC sid
In DepthDetails US Patent