BDBM290609 US10099993, Compound 194
SMILES Cc1c(C)c(ccc1OCCCCOc1ccccn1)C(=O)CC1CCCC1
InChI Key InChIKey=VDUKZBYPVQCZFP-UHFFFAOYSA-N
Data  2 EC50
  Tab Delimited (TSV)   2D SDfile   Computed 3D by Vconf -m prep SDfile
Find this compound or compounds like it in BindingDB:
Activity Spreadsheet -- Enzyme Inhibition Constant Data from BindingDB
Found 2 hits for monomerid = 290609
TargetMetabotropic glutamate receptor 3(Homo sapiens (Human))
Sanford-Burnham Medical Research Institute
US Patent
LigandPNGBDBM290609(US10099993, Compound 194)
Affinity DataEC50: >3.00E+4nM
Ligand InfoPC cidPC sid
In DepthDetails US Patent
TargetMetabotropic glutamate receptor 2(Homo sapiens (Human))
Sanford-Burnham Medical Research Institute
US Patent
LigandPNGBDBM290609(US10099993, Compound 194)
Affinity DataEC50: >1.00E+4nMpH: 7.3 T: 2°C. Assay description: Human Embryonic Kidney (HEK-293) cell lines co-expressing rat mGlu receptors 2, 3, 4, 6, 7 or 8 and G protein-coupled inwardly-rectifying potassium (...
Ligand InfoPC cidPC sid
In DepthDetails US Patent