BDBM290900 2-((4-aminotetrahydro-2H-pyran-4-yl)methylamino)-4-(m-tolylamino)pyrimidine-5-carboxamide::US9579320, Example 314
SMILES Cc1cccc(Nc2nc(NCC3(N)CCOCC3)ncc2C(N)=O)c1
InChI Key InChIKey=MRWHILPGBDERBY-UHFFFAOYSA-N
Data  1 IC50
  Tab Delimited (TSV)   2D SDfile   Computed 3D by Vconf -m prep SDfile
Find this compound or compounds like it in BindingDB:
Activity Spreadsheet -- Enzyme Inhibition Constant Data from BindingDB
Found 1 hit for monomerid = 290900
TargetTyrosine-protein kinase SYK(Homo sapiens (Human))
Portola Pharmaceuticals
US Patent
LigandPNGBDBM290900(2-((4-aminotetrahydro-2H-pyran-4-yl)methylamino)-4...)
Affinity DataIC50:  550nMpH: 7.5 T: 2°C. Assay description: Potency of candidate molecules for inhibiting syk tyrosine phosphorylation activity is assessed by measuring the ability of a test compound to inhibi...
Ligand InfoPC cidPC sid
In DepthDetails US Patent