BDBM291569 N-(3-(4-(4-phenoxyphenoxy)pyridin-3-yl)phenyl)but-2-ynamide ::US10413562, Compound A296::US9580449, Example A296
SMILES CC#CC(=O)Nc1cccc(c1)-c1cnccc1Oc1ccc(Oc2ccccc2)cc1
InChI Key InChIKey=CURLIMPFTVEHSP-UHFFFAOYSA-N
Data  2 IC50
  Tab Delimited (TSV)   2D SDfile   Computed 3D by Vconf -m prep SDfile
Find this compound or compounds like it in BindingDB:
Activity Spreadsheet -- Enzyme Inhibition Constant Data from BindingDB
Found 2 hits for monomerid = 291569
TargetTyrosine-protein kinase BTK(Homo sapiens (Human))
Merck Patent
US Patent
LigandPNGBDBM291569(N-(3-(4-(4-phenoxyphenoxy)pyridin-3-yl)phenyl)but-...)
Affinity DataIC50: <1.00E+3nM. Assay description: 2.5× stocks of full-length human BTK (08-080) from CarnaBio USA, Inc., Natick, Mass., 1.6×ATP and appropriate kinKDR peptide substrate (FITC-AHA-EEPL...
Ligand InfoPC cidPC sid
In DepthDetails US Patent
TargetTyrosine-protein kinase BTK(Homo sapiens (Human))
Merck Patent
US Patent
LigandPNGBDBM291569(N-(3-(4-(4-phenoxyphenoxy)pyridin-3-yl)phenyl)but-...)
Affinity DataIC50: <1.00E+3nMpH: 7.5 T: 2°C. Assay description: The following describes a microfluidic, off-chip mobility shift kinase assay used to measure inherent potency of compounds against BTK enzyme. Compou...
Ligand InfoPC cidPC sid
In DepthDetails US Patent