BDBM291782 US11207325, Example 97::US9580437, Example 97::methyl 4-(5-(5-(((2,3-dihydrobenzofuran-4-yl)methyl)amino)-[1,2,4]triazolo[4,3-c]pyrimidin-8-yl)pyridin-2-yl)piperazine-1-carboxylate
SMILES COC(=O)N1CCN(CC1)c1ccc(cn1)-c1cnc(NCc2cccc3OCCc23)n2cnnc12
InChI Key InChIKey=BVWYYZMMLLMIQW-UHFFFAOYSA-N
Data  6 IC50
  Tab Delimited (TSV)   2D SDfile   Computed 3D by Vconf -m prep SDfile
Find this compound or compounds like it in BindingDB:
Activity Spreadsheet -- Enzyme Inhibition Constant Data from BindingDB
Found 6 hits for monomerid = 291782
LigandPNGBDBM291782(US11207325, Example 97 | US9580437, Example 97 | m...)
Affinity DataIC50:  6.10nMpH: 8.0Assay Description:To assess the compounds potency in the EED-H3K27Me3 competition binding assay, compounds were serially diluted 3-fold in DMSO to obtain a total of tw...
Ligand InfoPC cidPC sid
In DepthDetails US Patent
LigandPNGBDBM291782(US11207325, Example 97 | US9580437, Example 97 | m...)
Affinity DataIC50:  8.60nMpH: 8.0Assay Description:Representative compounds of the present disclosure were serially and separately diluted 3-fold in DMSO to obtain a total of eight or twelve concentra...
Ligand InfoPC cidPC sid
In DepthDetails US Patent
TargetPolycomb protein EED(Homo sapiens (Human))
Novartis
US Patent
LigandPNGBDBM291782(US11207325, Example 97 | US9580437, Example 97 | m...)
Affinity DataIC50:  183nM. Assay description: Representative compounds of the present disclosure were serially and separately diluted 3-fold in DMSO to obtain a total of eight or twelve concentra...
Ligand InfoPC cidPC sid
In DepthDetails US Patent
TargetPolycomb protein EED(Homo sapiens (Human))
Novartis
US Patent
LigandPNGBDBM291782(US11207325, Example 97 | US9580437, Example 97 | m...)
Affinity DataIC50:  6.10nM. Assay description: To assess the compounds potency in the EED-H3K27Me3 competition binding assay, compounds were serially diluted 3-fold in DMSO to obtain a total of tw...
Ligand InfoPC cidPC sid
In DepthDetails US Patent
TargetPolycomb protein EED(Homo sapiens (Human))
Novartis
US Patent
LigandPNGBDBM291782(US11207325, Example 97 | US9580437, Example 97 | m...)
Affinity DataIC50:  8.60nM. Assay description: Representative compounds of the present disclosure were serially and separately diluted 3-fold in DMSO to obtain a total of eight or twelve concentra...
Ligand InfoPC cidPC sid
In DepthDetails US Patent
LigandPNGBDBM291782(US11207325, Example 97 | US9580437, Example 97 | m...)
Affinity DataIC50:  183nM. Assay description: Cell lysates were transferred to the wells of a 384-well plate and the final volume was adjusted to 50 μL per well with PBS. The plate was seale...
Ligand InfoPC cidPC sid
In DepthDetails US Patent