BDBM291849 N-((5-fluoro-2,3-dihydrobenzofuran-4-yl)methyl)-8-(6-fluoro-2-methylpyridin-3-yl)-[1,2,4]triazolo[4,3-c]pyrimidin-5-amine::US11207325, Example 164::US9580437, Example 164
SMILES Cc1nc(F)ccc1-c1cnc(NCc2c3CCOc3ccc2F)n2cnnc12
InChI Key InChIKey=LWXVRMZBZZZGRX-UHFFFAOYSA-N
Data  4 IC50
  Tab Delimited (TSV)   2D SDfile   Computed 3D by Vconf -m prep SDfile
Find this compound or compounds like it in BindingDB:
Activity Spreadsheet -- Enzyme Inhibition Constant Data from BindingDB
Found 4 hits for monomerid = 291849
LigandPNGBDBM291849(N-((5-fluoro-2,3-dihydrobenzofuran-4-yl)methyl)-8-...)
Affinity DataIC50:  4.20nMpH: 8.0Assay Description:To assess the compounds potency in the EED-H3K27Me3 competition binding assay, compounds were serially diluted 3-fold in DMSO to obtain a total of tw...
Ligand InfoPC cidPC sid
In DepthDetails US Patent
TargetPolycomb protein EED(Homo sapiens (Human))
Novartis
US Patent
LigandPNGBDBM291849(N-((5-fluoro-2,3-dihydrobenzofuran-4-yl)methyl)-8-...)
Affinity DataIC50:  13.9nM. Assay description: Representative compounds of the present disclosure were serially and separately diluted 3-fold in DMSO to obtain a total of eight or twelve concentra...
Ligand InfoPC cidPC sid
In DepthDetails US Patent
TargetPolycomb protein EED(Homo sapiens (Human))
Novartis
US Patent
LigandPNGBDBM291849(N-((5-fluoro-2,3-dihydrobenzofuran-4-yl)methyl)-8-...)
Affinity DataIC50:  4.20nM. Assay description: To assess the compounds potency in the EED-H3K27Me3 competition binding assay, compounds were serially diluted 3-fold in DMSO to obtain a total of tw...
Ligand InfoPC cidPC sid
In DepthDetails US Patent
LigandPNGBDBM291849(N-((5-fluoro-2,3-dihydrobenzofuran-4-yl)methyl)-8-...)
Affinity DataIC50:  13.9nMpH: 8.0Assay Description:Representative compounds of the present disclosure were serially and separately diluted 3-fold in DMSO to obtain a total of eight or twelve concentra...
Ligand InfoPC cidPC sid
In DepthDetails US Patent