BDBM291946 US10100019, Example 16
SMILES CCNC(=O)NCCc1ccc(OC)c(Nc2ncc(Cl)c(Nc3ccccc3S(=O)(=O)C(C)C)n2)c1
InChI Key InChIKey=DRPOUFRDMKUUKI-UHFFFAOYSA-N
Data  3 IC50
  Tab Delimited (TSV)   2D SDfile   Computed 3D by Vconf -m prep SDfile
Find this compound or compounds like it in BindingDB:
Activity Spreadsheet -- Enzyme Inhibition Constant Data from BindingDB
Found 3 hits for monomerid = 291946
TargetALK tyrosine kinase receptor(Homo sapiens (Human))
Korea Research Institute Of Chemical Technology
US Patent
LigandPNGBDBM291946(US10100019, Example 16)
Affinity DataIC50:  10nMT: 2°C. Assay description: The following experiment was performed in order to measure the activity of the N2-(2-methoxyphenyl)pyrimidine derivative represented by formula 1 of ...
Ligand InfoPC cidPC sid
In DepthDetails US Patent
TargetInsulin receptor(Homo sapiens (Human))
Korea Research Institute Of Chemical Technology
US Patent
LigandPNGBDBM291946(US10100019, Example 16)
Affinity DataIC50:  50nM. Assay description: To measure the activity of the N2-(2-methoxyphenyl)pyrimidine derivative represented by formula 1 of the present invention to inhibit anaplastic lymp...
Ligand InfoPC cidPC sid
In DepthDetails US Patent
TargetALK tyrosine kinase receptor [L1196M](Homo sapiens (Human))
Korea Research Institute Of Chemical Technology
US Patent
LigandPNGBDBM291946(US10100019, Example 16)
Affinity DataIC50:  60nM. Assay description: To measure the activity of the N2-(2-methoxyphenyl)pyrimidine derivative represented by formula 1 of the present invention to inhibit anaplastic lymp...
Ligand InfoPC cidPC sid
In DepthDetails US Patent