BDBM29201 3-carboxamido coumarin, 51
SMILES O=C(NNc1ccccc1)c1cc2ccc(OCc3ccccc3)cc2oc1=O
InChI Key InChIKey=OSWDDFNVOXEAGK-UHFFFAOYSA-N
Data  2 IC50
  Tab Delimited (TSV)   2D SDfile   Computed 3D by Vconf -m prep SDfile
Find this compound or compounds like it in BindingDB:
Activity Spreadsheet -- Enzyme Inhibition Constant Data from BindingDB
Found 2 hits for monomerid = 29201
TargetAmine oxidase [flavin-containing] B(Homo sapiens (Human))
Sapienza University Of Rome
LigandPNGBDBM29201(3-carboxamido coumarin, 51)
Affinity DataIC50:  4.52E+3nM. Assay description: The effects of the test compounds on hMAO isoform enzymatic activity were evaluated by measuring their effects on the production of hydrogen peroxide...
Ligand InfoPC cidPC sid
In DepthDetails ArticlePubMed
TargetAmine oxidase [flavin-containing] A(Homo sapiens (Human))
Sapienza University Of Rome
LigandPNGBDBM29201(3-carboxamido coumarin, 51)
Affinity DataIC50:  4.14E+4nM. Assay description: The effects of the test compounds on hMAO isoform enzymatic activity were evaluated by measuring their effects on the production of hydrogen peroxide...
Ligand InfoPC cidPC sid
In DepthDetails ArticlePubMed