BDBM292059 2-(Difluoromethyl)-3-(7-methyl-1H-indazol-5-yl)-5-(trifluoromethyl)-2H-::US10100045, Example 30
SMILES Cc1cc(cc2cn[nH]c12)-c1n(nc2ccc(nc12)C(F)(F)F)C(F)F
InChI Key InChIKey=CGSIRALUIGGXJZ-UHFFFAOYSA-N
Data  1 IC50
  Tab Delimited (TSV)   2D SDfile   Computed 3D by Vconf -m prep SDfile
Find this compound or compounds like it in BindingDB:
Activity Spreadsheet -- Enzyme Inhibition Constant Data from BindingDB
Found 1 hit for monomerid = 292059
TargetVoltage-dependent calcium channel gamma-2 subunit(Homo sapiens (Human))
Janssen Pharmaceutica
US Patent
LigandPNGBDBM292059(2-(Difluoromethyl)-3-(7-methyl-1H-indazol-5-yl)-5-...)
Affinity DataIC50:  0.631nMpH: 7.4Assay Description:Cell expressing the GRIA1o-CACNG8 fusion construct were grown in a monolayer in 96- or 384-well microtiter plates. They were washed with assay buffer...
Ligand InfoPC cidPC sid
In DepthDetails US Patent