BDBM29238 quinolinone, 9
SMILES Cc1ncsc1C(=O)N(Cc1cc(=O)[nH]c2ccccc12)c1ccccc1
InChI Key InChIKey=ZUOJFKLDYLRBKL-UHFFFAOYSA-N
Data  3 EC50
  Tab Delimited (TSV)   2D SDfile   Computed 3D by Vconf -m prep SDfile
Find this compound or compounds like it in BindingDB:
Activity Spreadsheet -- Enzyme Inhibition Constant Data from BindingDB
Found 3 hits for monomerid = 29238
TargetNitric oxide synthase, inducible(Homo sapiens (Human))
Kalypsys
LigandPNGBDBM29238(quinolinone, 9)
Affinity DataEC50:  500nMT: 2°C. Assay description: HEK293 cells (ATCC) were transiently transfected with recombinant NOS and grown. Cells were trypsinized, resuspended to 5 00,000 cells/mL, and plated...
In DepthDetails ArticlePubMed
TargetNitric oxide synthase, brain(Homo sapiens (Human))
Kalypsys
LigandPNGBDBM29238(quinolinone, 9)
Affinity DataEC50: >1.00E+4nMT: 2°C. Assay description: HEK293 cells (ATCC) were transiently transfected with recombinant NOS and grown. Cells were trypsinized, resuspended to 5 00,000 cells/mL, and plated...
In DepthDetails ArticlePubMed
TargetNitric oxide synthase, endothelial(Homo sapiens (Human))
Kalypsys
LigandPNGBDBM29238(quinolinone, 9)
Affinity DataEC50: >1.00E+5nMT: 2°C. Assay description: HEK293 cells (ATCC) were transiently transfected with recombinant NOS and grown. Cells were trypsinized, resuspended to 5 00,000 cells/mL, and plated...
In DepthDetails ArticlePubMed