BDBM292711 US10106501, Example A
SMILES COCCN1CCN(CC1)C(=O)c1ccc(Cl)c(Cc2cc3c(C)cc(cc3n2C)C(F)(F)F)c1Cl
InChI Key InChIKey=NVYIMYFBPUMFNN-UHFFFAOYSA-N
Data  1 IC50
  Tab Delimited (TSV)   2D SDfile   Computed 3D by Vconf -m prep SDfile
Find this compound or compounds like it in BindingDB:
Activity Spreadsheet -- Enzyme Inhibition Constant Data from BindingDB
Found 1 hit for monomerid = 292711
TargetNuclear receptor ROR-gamma(Homo sapiens (Human))
Abbvie
US Patent
LigandPNGBDBM292711(US10106501, Example A)
Affinity DataIC50: <100nM. Assay description: The primary screen was performed by transient transactivation assays. These cell-based assays were carried out using Cos-7 cells transfected with a c...
Ligand InfoPC cidPC sid
In DepthDetails US Patent