BDBM292725 US10106501, Example B-2
SMILES Cc1cc(cc2n(C)c(Cc3c(Cl)ccc(C(=O)N4CCC(CC4)OCC(O)=O)c3Cl)cc12)C(F)(F)F
InChI Key InChIKey=VRHYDLLTXRRGLH-UHFFFAOYSA-N
Data  1 IC50
  Tab Delimited (TSV)   2D SDfile   Computed 3D by Vconf -m prep SDfile
Find this compound or compounds like it in BindingDB:
Activity Spreadsheet -- Enzyme Inhibition Constant Data from BindingDB
Found 1 hit for monomerid = 292725
TargetNuclear receptor ROR-gamma(Homo sapiens (Human))
Abbvie
US Patent
LigandPNGBDBM292725(US10106501, Example B-2)
Affinity DataIC50: <100nM. Assay description: The primary screen was performed by transient transactivation assays. These cell-based assays were carried out using Cos-7 cells transfected with a c...
Ligand InfoPC cidPC sid
In DepthDetails US Patent