BDBM293122 US10106501, Example BJ-14
SMILES Cc1cc(cc2n(C)c(Cc3c(Cl)ccc(C(=O)N4CCC(CC(C)(C)O)CC4)c3Cl)nc12)C(F)(F)F
InChI Key InChIKey=YILVIKMCFQFKNJ-UHFFFAOYSA-N
Data  1 IC50
  Tab Delimited (TSV)   2D SDfile   Computed 3D by Vconf -m prep SDfile
Find this compound or compounds like it in BindingDB:
Activity Spreadsheet -- Enzyme Inhibition Constant Data from BindingDB
Found 1 hit for monomerid = 293122
TargetNuclear receptor ROR-gamma(Homo sapiens (Human))
Abbvie
US Patent
LigandPNGBDBM293122(US10106501, Example BJ-14)
Affinity DataIC50:  300nM. Assay description: The primary screen was performed by transient transactivation assays. These cell-based assays were carried out using Cos-7 cells transfected with a c...
Ligand InfoPC cidPC sid
In DepthDetails US Patent