BDBM293861 3-({[(4R)-7-(1-phenylcyclopropyl)-3,4-dihydro-2H-1-benzopyran-::US10106534, Example 203
SMILES OC(=O)c1ccncc1NC[C@@H]1CCOc2cc(ccc12)C1(CC1)c1ccccc1
InChI Key InChIKey=VBBPCCLJBJVXGM-KRWDZBQOSA-N
Data  1 IC50
  Tab Delimited (TSV)   2D SDfile   Computed 3D by Vconf -m prep SDfile
Find this compound or compounds like it in BindingDB:
Activity Spreadsheet -- Enzyme Inhibition Constant Data from BindingDB
Found 1 hit for monomerid = 293861
TargetLysine-specific demethylase 4C(Homo sapiens (Human))
Celgene Quanticel Research
US Patent
LigandPNGBDBM293861(3-({[(4R)-7-(1-phenylcyclopropyl)-3,4-dihydro-2H-1...)
Affinity DataIC50:  550nMT: 2°C. Assay description: The ability of test compounds to inhibit the activity of JMJD2C was determined in 384-well plate format under the following reaction conditions: 0.3 ...
Ligand InfoPC cidPC sid
In DepthDetails US Patent