BDBM294325 US9586948, Example 44
SMILES Cn1cc(NC(=O)c2cccc(n2)-c2ccnc(NCC3CC3)c2)c(n1)C(=O)NCCc1cnccn1
InChI Key InChIKey=RMEHEEJYTOURLM-UHFFFAOYSA-N
Data  1 IC50
  Tab Delimited (TSV)   2D SDfile   Computed 3D by Vconf -m prep SDfile
Find this compound or compounds like it in BindingDB:
Activity Spreadsheet -- Enzyme Inhibition Constant Data from BindingDB
Found 1 hit for monomerid = 294325
TargetInterleukin-1 receptor-associated kinase 4(Homo sapiens (Human))
Merck Sharp & Dohme
US Patent
LigandPNGBDBM294325(US9586948, Example 44)
Affinity DataIC50:  2.67E+3nMpH: 7.2Assay Description:The kinase activity of IRAK4 is determined by its ability to catalyze the phosphorylation of a fluorescent polypeptide substrate. The extent of phosp...
Ligand InfoPC cidPC sid
In DepthDetails US Patent