BDBM294607 US10112899, Example 87
SMILES C[C@H]1CCCN1C(=O)N1Cc2c(C1)c(C)c(-c1ccc(C)cc1)c([C@H](OC(C)(C)C)C(O)=O)c2C
InChI Key InChIKey=ODKKYUSHEASXTK-QYBDOPJKSA-N
Data  1 IC50
  Tab Delimited (TSV)   2D SDfile   Computed 3D by Vconf -m prep SDfile
Find this compound or compounds like it in BindingDB:
Activity Spreadsheet -- Enzyme Inhibition Constant Data from BindingDB
Found 1 hit for monomerid = 294607
TargetIntegrase(Human immunodeficiency virus 1)
Viiv Healthcare
US Patent
LigandPNGBDBM294607(US10112899, Example 87)
Affinity DataIC50:  5nM. Assay description: Antiviral HIV activity and cytotoxicity values for compounds of the invention from Table 1 were measured in parallel in the HTLV-1 transformed cell l...
Ligand InfoPC cidPC sid
In DepthDetails US Patent