BDBM294802 US10112899, Example 273
SMILES Cc1ccc(cc1)-c1c(C)c2CN(Cc2c(C)c1[C@H](OC(C)(C)C)C(O)=O)C(=O)c1ccccn1
InChI Key InChIKey=OPEYOBXHXMOKKA-SANMLTNESA-N
Data  1 IC50
  Tab Delimited (TSV)   2D SDfile   Computed 3D by Vconf -m prep SDfile
Find this compound or compounds like it in BindingDB:
Activity Spreadsheet -- Enzyme Inhibition Constant Data from BindingDB
Found 1 hit for monomerid = 294802
TargetIntegrase(Human immunodeficiency virus 1)
Viiv Healthcare
US Patent
LigandPNGBDBM294802(US10112899, Example 273)
Affinity DataIC50:  4nM. Assay description: Antiviral HIV activity and cytotoxicity values for compounds of the invention from Table 1 were measured in parallel in the HTLV-1 transformed cell l...
Ligand InfoPC cidPC sid
In DepthDetails US Patent