BDBM294835 US10112899, Example 306::US10112899, Example 326
SMILES Cc1ccc(c(Cl)c1)-c1c(C)c2CN(Cc2c(C)c1[C@H](OC(C)(C)C)C(O)=O)C(=O)c1cccc(F)c1
InChI Key InChIKey=GBIJZTGFYCAIKL-MHZLTWQESA-N
Data  2 IC50
  Tab Delimited (TSV)   2D SDfile   Computed 3D by Vconf -m prep SDfile
Find this compound or compounds like it in BindingDB:
Activity Spreadsheet -- Enzyme Inhibition Constant Data from BindingDB
Found 2 hits for monomerid = 294835
TargetIntegrase(Human immunodeficiency virus 1)
Viiv Healthcare
US Patent
LigandPNGBDBM294835(US10112899, Example 306 | US10112899, Example 326)
Affinity DataIC50:  5nM. Assay description: Antiviral HIV activity and cytotoxicity values for compounds of the invention from Table 1 were measured in parallel in the HTLV-1 transformed cell l...
Ligand InfoPC cidPC sid
In DepthDetails US Patent
TargetIntegrase(Human immunodeficiency virus 1)
Viiv Healthcare
US Patent
LigandPNGBDBM294835(US10112899, Example 306 | US10112899, Example 326)
Affinity DataIC50:  38nM. Assay description: Antiviral HIV activity and cytotoxicity values for compounds of the invention from Table 1 were measured in parallel in the HTLV-1 transformed cell l...
Ligand InfoPC cidPC sid
In DepthDetails US Patent