BDBM298149 US10118915, Compound 409
SMILES CC(C)OC(=O)c1cc(C)nnc1N1CCC(CC1)NC1CCOCC1
InChI Key InChIKey=UDMKTQXEBXQHST-UHFFFAOYSA-N
Data  1 IC50
  Tab Delimited (TSV)   2D SDfile   Computed 3D by Vconf -m prep SDfile
Find this compound or compounds like it in BindingDB:
Activity Spreadsheet -- Enzyme Inhibition Constant Data from BindingDB
Found 1 hit for monomerid = 298149
TargetKappa-type opioid receptor(Homo sapiens (Human))
The Scripps Research Institute
US Patent
LigandPNGBDBM298149(US10118915, Compound 409)
Affinity DataIC50:  129nM. Assay description: Well-known assay for kappa opioid receptor
Ligand InfoPC cidPC sid
In DepthDetails US Patent