BDBM29830 spiro-carboxamide scaffold, 3
SMILES Clc1ccc(cc1)C1(CC1)C(=O)N1CCC2(CCc3ccccc23)C1
InChI Key InChIKey=IZOFFRWQNSMOTN-UHFFFAOYSA-N
Data  3 IC50
  Tab Delimited (TSV)   2D SDfile   Computed 3D by Vconf -m prep SDfile
Find this compound or compounds like it in BindingDB:
Activity Spreadsheet -- Enzyme Inhibition Constant Data from BindingDB
Found 3 hits for monomerid = 29830
Target11-beta-hydroxysteroid dehydrogenase 1(Homo sapiens (Human))
Merck Serono
LigandPNGBDBM29830(spiro-carboxamide scaffold, 3)
Affinity DataIC50:  25nMpH: 7.4 T: 2°C. Assay description: 11beta-HSD1 enzyme activity was assessed in buffer containing a substrate mixture cortisone/NADPH in the presence of test compound. Reaction was init...
In DepthDetails ArticlePubMed
Target11-beta-hydroxysteroid dehydrogenase type 2(Homo sapiens (Human))
Merck Serono
LigandPNGBDBM29830(spiro-carboxamide scaffold, 3)
Affinity DataIC50: >1.00E+5nMpH: 7.8 T: 2°C. Assay description: 11beta-HSD2 enzyme activity was assessed in buffer containing NAD, test compound, and human recombinant 11beta-HSD2 expressed in E. coli. Reaction wa...
In DepthDetails ArticlePubMed
Target11-beta-hydroxysteroid dehydrogenase 1(Mus musculus (mouse))
Merck Serono
LigandPNGBDBM29830(spiro-carboxamide scaffold, 3)
Affinity DataIC50:  2.60E+3nMpH: 7.4 T: 2°C. Assay description: 11beta-HSD1 enzyme activity was assessed in buffer containing a substrate mixture cortisone/NADPH in the presence of test compound. Reaction was init...
In DepthDetails ArticlePubMed